Skip to Content

compiling fails........

3 replies [Last post]
yervah
Offline
Joined: 04/17/2010

I finally got the 9.4 snapshot to build. I got a patch from someone named Paul.
Both him and I can't get the svn versions to build,.

these are my errors:

/home/yervah/hydrogen/unittest'
g++ -c -pipe -march=i686 -mtune=generic -O2 -pipe -g -Wall -Wall -W -D_REENTRANT -DALSA_SUPPORT -DJACK_SUPPORT -DFLAC_SUPPORT -DLADSPA_SUPPORT -DLRDF_SUPPORT -DOSS_SUPPORT -DQT_NO_DEBUG -DQT_XML_LIB -DQT_GUI_LIB -DQT_NETWORK_LIB -DQT_CORE_LIB -DQT_SHARED -I/opt/qt4/mkspecs/linux-g++ -I. -I/opt/qt4/include/QtCore -I/opt/qt4/include/QtCore -I/opt/qt4/include/QtNetwork -I/opt/qt4/include/QtNetwork -I/opt/qt4/include/QtGui -I/opt/qt4/include/QtGui -I/opt/qt4/include/QtXml -I/opt/qt4/include/QtXml -I/opt/qt4/include -I.. -I../libs/hydrogen/include -I. -I. -o main.o main.cpp
main.cpp:1:39: error: cppunit/CompilerOutputter.h: No such file or directory
main.cpp:2:52: error: cppunit/extensions/TestFactoryRegistry.h: No such file or directory
main.cpp:3:40: error: cppunit/ui/text/TestRunner.h: No such file or directory
In file included from main.cpp:6:
instrument_test.cpp:1:30: error: cppunit/TestCase.h: No such file or directory
In file included from main.cpp:6:
instrument_test.cpp:8: error: ‘CppUnit’ has not been declared
instrument_test.cpp:8: error: expected `{' before ‘TestCase’
instrument_test.cpp:8: error: function definition does not declare parameters
In file included from main.cpp:7:
note_test.cpp:8: error: ‘CppUnit’ has not been declared
note_test.cpp:8: error: expected `{' before ‘TestCase’
note_test.cpp:8: error: function definition does not declare parameters
main.cpp: In function ‘int main(int, char**)’:
main.cpp:11: error: ‘CppUnit’ has not been declared
main.cpp:11: error: expected `;' before ‘runner’
main.cpp:12: error: ‘runner’ was not declared in this scope
main.cpp:12: error: invalid use of incomplete type ‘class InstrumentTest’
instrument_test.cpp:8: error: forward declaration of ‘class InstrumentTest’
main.cpp:13: error: invalid use of incomplete type ‘class NoteTest’
note_test.cpp:8: error: forward declaration of ‘class NoteTest’
main.cpp:16: error: expected type-specifier before ‘CppUnit’
main.cpp:16: error: expected `)' before ‘CppUnit’
main.cpp: At global scope:
main.cpp:9: warning: unused parameter ‘argc’
main.cpp:9: warning: unused parameter ‘argv’
make[1]: *** [main.o] Error 1
make[1]: Leaving directory `/home/yervah/hydrogen/unittest'
make: *** [sub-unittest-make_default] Error 2

Comix
Offline
Joined: 04/17/2010

apt-get install libcppunit-dev

--
comix http://comix.hydrogen-music.org

yervah
Offline
Joined: 04/17/2010

thanx. works now.
only records the drums in mono.
I linked up to Ardour, connected each drum to a track, recorded but only getting left side of each drum track.

raj84
Offline
Joined: 04/17/2010

There are 3 step to repair hammer editor error

If you got hammer editor error then there is a 94% chance that your computer has registry problems. To repair hammer editor error you need to follow the steps below:

* Step 1 - Download a hammer editor error repair tool,install this error repair tool.
* Step 2 - Click the Repair All Button.It will scan you pc for Free.
* Step 3 - Then click the Repair All Button again and your done! It is very easy to repair hammer editor error.

_____________

http://www.key2seo.com]SEO services[/url] | [url=http://www.convert2xhtml.com